Reaction Details
TargetProgesterone receptor
LigandBDBM50348405
Substrate/Competitorn/a
Meas. Tech.ChEMBL_754804 (CHEMBL1805659)
Ki 53±n/a nM
Citation Yang, BVWeinstein, DSDoweyko, LMGong, HVaccaro, WHuynh, TXiao, HYDoweyko, AMMcKay, LHolloway, DASomerville, JEHabte, SCunningham, MMcMahon, MTownsend, RShuster, DDodd, JHNadler, SGBarrish, JC Dimethyl-diphenyl-propanamide Derivatives As Nonsteroidal Dissociated Glucocorticoid Receptor Agonists. J Med Chem53:8241-51 (2010) 
 
Progesterone receptor
Name:Progesterone receptor
Type:Protein
Mol. Mass.:98979.52
Organism:Homo sapiens (Human)
Description:P06401
Residue:933
BDBM50348405
NameBDBM50348405
Synonyms:CHEMBL1801008
TypeSmall organic molecule
Emp. Form.C20H19FN2O2S
Mol. Mass.370.44
SMILESCC(C)([C@@H](c1ccccc1)c1ccc(O)c(F)c1)C(=O)Nc1nccs1