Reaction Details
TargetProgesterone receptor
LigandBDBM50348408
Substrate/Competitorn/a
Meas. Tech.ChEMBL_754804 (CHEMBL1805659)
Ki 144±n/a nM
Citation Yang, BVWeinstein, DSDoweyko, LMGong, HVaccaro, WHuynh, TXiao, HYDoweyko, AMMcKay, LHolloway, DASomerville, JEHabte, SCunningham, MMcMahon, MTownsend, RShuster, DDodd, JHNadler, SGBarrish, JC Dimethyl-diphenyl-propanamide Derivatives As Nonsteroidal Dissociated Glucocorticoid Receptor Agonists. J Med Chem53:8241-51 (2010) 
 
Progesterone receptor
Name:Progesterone receptor
Type:Protein
Mol. Mass.:98979.52
Organism:Homo sapiens (Human)
Description:P06401
Residue:933
BDBM50348408
NameBDBM50348408
Synonyms:CHEMBL1801005
TypeSmall organic molecule
Emp. Form.C21H19N3O2S
Mol. Mass.377.459
SMILESCC(C)([C@@H](c1ccccc1)c1ccc(O)c(c1)C#N)C(=O)Nc1nccs1