Reaction Details
TargetProgesterone receptor
LigandBDBM50348413
Substrate/Competitorn/a
Meas. Tech.ChEMBL_754804 (CHEMBL1805659)
Ki 140±n/a nM
Citation Yang, BVWeinstein, DSDoweyko, LMGong, HVaccaro, WHuynh, TXiao, HYDoweyko, AMMcKay, LHolloway, DASomerville, JEHabte, SCunningham, MMcMahon, MTownsend, RShuster, DDodd, JHNadler, SGBarrish, JC Dimethyl-diphenyl-propanamide Derivatives As Nonsteroidal Dissociated Glucocorticoid Receptor Agonists. J Med Chem53:8241-51 (2010) 
 
Progesterone receptor
Name:Progesterone receptor
Type:Protein
Mol. Mass.:98979.52
Organism:Homo sapiens (Human)
Description:P06401
Residue:933
BDBM50348413
NameBDBM50348413
Synonyms:CHEMBL1800983
TypeSmall organic molecule
Emp. Form.C20H21N3O2S
Mol. Mass.367.465
SMILESCc1cc(ccc1O)[C@H](c1ccccc1)C(C)(C)C(=O)Nc1nncs1