Reaction Details
TargetAndrogen receptor
LigandBDBM50348401
Substrate/Competitorn/a
Meas. Tech.ChEMBL_754805 (CHEMBL1805660)
Ki 1058±n/a nM
Citation Yang, BVWeinstein, DSDoweyko, LMGong, HVaccaro, WHuynh, TXiao, HYDoweyko, AMMcKay, LHolloway, DASomerville, JEHabte, SCunningham, MMcMahon, MTownsend, RShuster, DDodd, JHNadler, SGBarrish, JC Dimethyl-diphenyl-propanamide Derivatives As Nonsteroidal Dissociated Glucocorticoid Receptor Agonists. J Med Chem53:8241-51 (2010) 
 
Androgen receptor
Name:Androgen receptor
Type:Receptor
Mol. Mass.:99185.27
Organism:Homo sapiens (Human)
Description:CHO cells were stably transfected with human AR gene.
Residue:920
BDBM50348401
NameBDBM50348401
Synonyms:CHEMBL1801012
TypeSmall organic molecule
Emp. Form.C20H20N2O2S
Mol. Mass.352.45
SMILESCC(C)([C@@H](c1ccccc1)c1ccc(O)cc1)C(=O)Nc1nccs1