Reaction Details
TargetAndrogen receptor
LigandBDBM50348405
Substrate/Competitorn/a
Meas. Tech.ChEMBL_754805 (CHEMBL1805660)
Ki 1034±n/a nM
Citation Yang, BVWeinstein, DSDoweyko, LMGong, HVaccaro, WHuynh, TXiao, HYDoweyko, AMMcKay, LHolloway, DASomerville, JEHabte, SCunningham, MMcMahon, MTownsend, RShuster, DDodd, JHNadler, SGBarrish, JC Dimethyl-diphenyl-propanamide Derivatives As Nonsteroidal Dissociated Glucocorticoid Receptor Agonists. J Med Chem53:8241-51 (2010) 
 
Androgen receptor
Name:Androgen receptor
Type:Receptor
Mol. Mass.:99185.27
Organism:Homo sapiens (Human)
Description:CHO cells were stably transfected with human AR gene.
Residue:920
BDBM50348405
NameBDBM50348405
Synonyms:CHEMBL1801008
TypeSmall organic molecule
Emp. Form.C20H19FN2O2S
Mol. Mass.370.44
SMILESCC(C)([C@@H](c1ccccc1)c1ccc(O)c(F)c1)C(=O)Nc1nccs1