Reaction Details
TargetGlucocorticoid receptor
LigandBDBM50348398
Substrate/Competitorn/a
Meas. Tech.ChEMBL_754806 (CHEMBL1805661)
Ki 2.9±n/a nM
Citation Yang, BVWeinstein, DSDoweyko, LMGong, HVaccaro, WHuynh, TXiao, HYDoweyko, AMMcKay, LHolloway, DASomerville, JEHabte, SCunningham, MMcMahon, MTownsend, RShuster, DDodd, JHNadler, SGBarrish, JC Dimethyl-diphenyl-propanamide Derivatives As Nonsteroidal Dissociated Glucocorticoid Receptor Agonists. J Med Chem53:8241-51 (2010) 
 
Glucocorticoid receptor
Name:Glucocorticoid receptor
Type:Enzyme
Mol. Mass.:85656.87
Organism:Homo sapiens (Human)
Description:P04150
Residue:777
BDBM50348398
NameBDBM50348398
Synonyms:CHEMBL1800979
TypeSmall organic molecule
Emp. Form.C20H20N2OS
Mol. Mass.336.451
SMILESCC(C)(C(c1ccccc1)c1ccccc1)C(=O)Nc1nccs1