Reaction Details
TargetGlucocorticoid receptor
LigandBDBM50348403
Substrate/Competitorn/a
Meas. Tech.ChEMBL_754806 (CHEMBL1805661)
Ki 20.7±n/a nM
Citation Yang, BVWeinstein, DSDoweyko, LMGong, HVaccaro, WHuynh, TXiao, HYDoweyko, AMMcKay, LHolloway, DASomerville, JEHabte, SCunningham, MMcMahon, MTownsend, RShuster, DDodd, JHNadler, SGBarrish, JC Dimethyl-diphenyl-propanamide Derivatives As Nonsteroidal Dissociated Glucocorticoid Receptor Agonists. J Med Chem53:8241-51 (2010) 
 
Glucocorticoid receptor
Name:Glucocorticoid receptor
Type:Enzyme
Mol. Mass.:85656.87
Organism:Homo sapiens (Human)
Description:P04150
Residue:777
BDBM50348403
NameBDBM50348403
Synonyms:CHEMBL1801010
TypeSmall organic molecule
Emp. Form.C20H19FN2O2S
Mol. Mass.370.44
SMILESCC(C)(C(c1ccccc1)c1ccc(O)cc1F)C(=O)Nc1nccs1