Reaction Details
TargetGlucocorticoid receptor
LigandBDBM50348406
Substrate/Competitorn/a
Meas. Tech.ChEMBL_754806 (CHEMBL1805661)
Ki 4.6±n/a nM
Citation Yang, BVWeinstein, DSDoweyko, LMGong, HVaccaro, WHuynh, TXiao, HYDoweyko, AMMcKay, LHolloway, DASomerville, JEHabte, SCunningham, MMcMahon, MTownsend, RShuster, DDodd, JHNadler, SGBarrish, JC Dimethyl-diphenyl-propanamide Derivatives As Nonsteroidal Dissociated Glucocorticoid Receptor Agonists. J Med Chem53:8241-51 (2010) 
 
Glucocorticoid receptor
Name:Glucocorticoid receptor
Type:Enzyme
Mol. Mass.:85656.87
Organism:Homo sapiens (Human)
Description:P04150
Residue:777
BDBM50348406
NameBDBM50348406
Synonyms:CHEMBL1801007
TypeSmall organic molecule
Emp. Form.C20H19FN2O2S
Mol. Mass.370.44
SMILESCC(C)([C@H](c1ccccc1)c1ccc(O)c(F)c1)C(=O)Nc1nccs1