Reaction Details
TargetGlucocorticoid receptor
LigandBDBM50348409
Substrate/Competitorn/a
Meas. Tech.ChEMBL_754806 (CHEMBL1805661)
Ki 7.3±n/a nM
Citation Yang, BVWeinstein, DSDoweyko, LMGong, HVaccaro, WHuynh, TXiao, HYDoweyko, AMMcKay, LHolloway, DASomerville, JEHabte, SCunningham, MMcMahon, MTownsend, RShuster, DDodd, JHNadler, SGBarrish, JC Dimethyl-diphenyl-propanamide Derivatives As Nonsteroidal Dissociated Glucocorticoid Receptor Agonists. J Med Chem53:8241-51 (2010) 
 
Glucocorticoid receptor
Name:Glucocorticoid receptor
Type:Enzyme
Mol. Mass.:85656.87
Organism:Homo sapiens (Human)
Description:P04150
Residue:777
BDBM50348409
NameBDBM50348409
Synonyms:CHEMBL1801003
TypeSmall organic molecule
Emp. Form.C22H22N2O3S
Mol. Mass.394.487
SMILESCC(=O)c1cc(ccc1O)[C@H](c1ccccc1)C(C)(C)C(=O)Nc1nccs1