Reaction Details
TargetGlucocorticoid receptor
LigandBDBM50348417
Substrate/Competitorn/a
Meas. Tech.ChEMBL_754806 (CHEMBL1805661)
Ki 6±n/a nM
Citation Yang, BVWeinstein, DSDoweyko, LMGong, HVaccaro, WHuynh, TXiao, HYDoweyko, AMMcKay, LHolloway, DASomerville, JEHabte, SCunningham, MMcMahon, MTownsend, RShuster, DDodd, JHNadler, SGBarrish, JC Dimethyl-diphenyl-propanamide Derivatives As Nonsteroidal Dissociated Glucocorticoid Receptor Agonists. J Med Chem53:8241-51 (2010) 
 
Glucocorticoid receptor
Name:Glucocorticoid receptor
Type:Enzyme
Mol. Mass.:85656.87
Organism:Homo sapiens (Human)
Description:P04150
Residue:777
BDBM50348417
NameBDBM50348417
Synonyms:CHEMBL1800987
TypeSmall organic molecule
Emp. Form.C19H17N3O2S
Mol. Mass.351.422
SMILESCC(C)(C1c2ccccc2Oc2ccccc12)C(=O)Nc1nncs1