Reaction Details
TargetAndrogen receptor
LigandBDBM50348407
Substrate/Competitorn/a
Meas. Tech.ChEMBL_754805 (CHEMBL1805660)
Ki 370±n/a nM
Citation Yang, BVWeinstein, DSDoweyko, LMGong, HVaccaro, WHuynh, TXiao, HYDoweyko, AMMcKay, LHolloway, DASomerville, JEHabte, SCunningham, MMcMahon, MTownsend, RShuster, DDodd, JHNadler, SGBarrish, JC Dimethyl-diphenyl-propanamide Derivatives As Nonsteroidal Dissociated Glucocorticoid Receptor Agonists. J Med Chem53:8241-51 (2010) 
 
Androgen receptor
Name:Androgen receptor
Type:Receptor
Mol. Mass.:99185.27
Organism:Homo sapiens (Human)
Description:CHO cells were stably transfected with human AR gene.
Residue:920
BDBM50348407
NameBDBM50348407
Synonyms:CHEMBL1801006
TypeSmall organic molecule
Emp. Form.C20H19BrN2O2S
Mol. Mass.431.346
SMILESCC(C)([C@@H](c1ccccc1)c1ccc(O)c(Br)c1)C(=O)Nc1nccs1