Reaction Details
TargetCytochrome P450 1A2
LigandBDBM50350021
Substrate/Competitorn/a
Meas. Tech.ChEMBL_761660 (CHEMBL1816652)
IC50>30000±n/a nM
Citation Hudkins, RLRaddatz, RTao, MMathiasen, JRAimone, LDBecknell, NCProuty, CPKnutsen, LJYazdanian, MMoachon, GAtor, MAMallamo, JPMarino, MJBacon, ERWilliams, M Discovery and characterization of 6-{4-[3-(R)-2-methylpyrrolidin-1-yl)propoxy]phenyl}-2H-pyridazin-3-one (CEP-26401, irdabisant): a potent, selective histamine H3 receptor inverse agonist. J Med Chem54:4781-92 (2011) 
 
Cytochrome P450 1A2
Name:Cytochrome P450 1A2
Type:Enzyme
Mol. Mass.:58423.38
Organism:Homo sapiens (Human)
Description:P05177
Residue:516
BDBM50350021
NameBDBM50350021
Synonyms:CHEMBL1813067
TypeSmall organic molecule
Emp. Form.C18H23N3O2
Mol. Mass.313.3941
SMILESC[C@@H]1CCCN1CCCOc1ccc(cc1)-c1ccc(=O)[nH]n1