Reaction Details
TargetHistamine H3 receptor
LigandBDBM50350022
Substrate/Competitorn/a
Meas. Tech.ChEMBL_761528 (CHEMBL1817408)
Ki 1.4±n/a nM
Citation Hudkins, RLRaddatz, RTao, MMathiasen, JRAimone, LDBecknell, NCProuty, CPKnutsen, LJYazdanian, MMoachon, GAtor, MAMallamo, JPMarino, MJBacon, ERWilliams, M Discovery and characterization of 6-{4-[3-(R)-2-methylpyrrolidin-1-yl)propoxy]phenyl}-2H-pyridazin-3-one (CEP-26401, irdabisant): a potent, selective histamine H3 receptor inverse agonist. J Med Chem54:4781-92 (2011) 
 
Histamine H3 receptor
Name:Histamine H3 receptor
Type:G Protein-Coupled Receptor (GPCR)
Mol. Mass.:48691.47
Organism:Homo sapiens (Human)
Description:Binding assays were using CHO cells stably expressing hH3R receptors.
Residue:445
BDBM50350022
NameBDBM50350022
Synonyms:CHEMBL1813057
TypeSmall organic molecule
Emp. Form.C19H25N3O2
Mol. Mass.327.4207
SMILESC[C@@H]1CCCN1CCCOc1ccc(cc1)-c1ccc(=O)n(C)n1