Reaction Details
TargetHistamine H3 receptor
LigandBDBM50350031
Substrate/Competitorn/a
Meas. Tech.ChEMBL_761529 (CHEMBL1817409)
Ki 12±n/a nM
Citation Hudkins, RLRaddatz, RTao, MMathiasen, JRAimone, LDBecknell, NCProuty, CPKnutsen, LJYazdanian, MMoachon, GAtor, MAMallamo, JPMarino, MJBacon, ERWilliams, M Discovery and characterization of 6-{4-[3-(R)-2-methylpyrrolidin-1-yl)propoxy]phenyl}-2H-pyridazin-3-one (CEP-26401, irdabisant): a potent, selective histamine H3 receptor inverse agonist. J Med Chem54:4781-92 (2011) 
 
Histamine H3 receptor
Name:Histamine H3 receptor
Type:G Protein-Coupled Receptor (GPCR)
Mol. Mass.:48607.98
Organism:Rattus norvegicus (rat)
Description:n/a
Residue:445
BDBM50350031
NameBDBM50350031
Synonyms:CHEMBL1813061
TypeSmall organic molecule
Emp. Form.C25H29N3O2
Mol. Mass.403.5167
SMILESC[C@@H]1CCCN1CCCOc1ccc(cc1)-c1ccc(=O)n(Cc2ccccc2)n1