Reaction Details
TargetMuscarinic acetylcholine receptor M2
LigandBDBM50350021
Substrate/Competitorn/a
Meas. Tech.ChEMBL_761550 (CHEMBL1817430)
Ki 3700±n/a nM
Citation Hudkins, RLRaddatz, RTao, MMathiasen, JRAimone, LDBecknell, NCProuty, CPKnutsen, LJYazdanian, MMoachon, GAtor, MAMallamo, JPMarino, MJBacon, ERWilliams, M Discovery and characterization of 6-{4-[3-(R)-2-methylpyrrolidin-1-yl)propoxy]phenyl}-2H-pyridazin-3-one (CEP-26401, irdabisant): a potent, selective histamine H3 receptor inverse agonist. J Med Chem54:4781-92 (2011) 
 
Muscarinic acetylcholine receptor M2
Name:Muscarinic acetylcholine receptor M2
Type:GPCR
Mol. Mass.:51730.61
Organism:Homo sapiens (Human)
Description:P08172
Residue:466
BDBM50350021
NameBDBM50350021
Synonyms:CHEMBL1813067
TypeSmall organic molecule
Emp. Form.C18H23N3O2
Mol. Mass.313.3941
SMILESC[C@@H]1CCCN1CCCOc1ccc(cc1)-c1ccc(=O)[nH]n1