Reaction Details
TargetSolute carrier family 15 member 2
LigandBDBM50169132
Substrate/Competitorn/a
Meas. Tech.ChEMBL_762551 (CHEMBL1817008)
Ki 6000±n/a nM
Citation Pedretti, ADe Luca, LMarconi, CRegazzoni, LAldini, GVistoli, G Fragmental modeling of hPepT2 and analysis of its binding features by docking studies and pharmacophore mapping. Bioorg Med Chem19:4544-51 (2011) 
 
Solute carrier family 15 member 2
Name:Solute carrier family 15 member 2
Type:PROTEIN
Mol. Mass.:81795.62
Organism:Homo sapiens (Human)
Description:ChEMBL_762551
Residue:729
BDBM50169132
NameBDBM50169132
Synonyms:(S)-2-((S)-2-Amino-propionylamino)-3-hydroxy-propionic acid CHEMBL190179
TypeSmall organic molecule
Emp. Form.C6H12N2O4
Mol. Mass.176.1705
SMILESC[C@H](N)C(=O)N[C@@H](CO)C(O)=O