Reaction Details
TargetSolute carrier family 15 member 2
LigandBDBM50169213
Substrate/Competitorn/a
Meas. Tech.ChEMBL_762551 (CHEMBL1817008)
Ki 29000±n/a nM
Citation Pedretti, ADe Luca, LMarconi, CRegazzoni, LAldini, GVistoli, G Fragmental modeling of hPepT2 and analysis of its binding features by docking studies and pharmacophore mapping. Bioorg Med Chem19:4544-51 (2011) 
 
Solute carrier family 15 member 2
Name:Solute carrier family 15 member 2
Type:PROTEIN
Mol. Mass.:81795.62
Organism:Homo sapiens (Human)
Description:ChEMBL_762551
Residue:729
BDBM50169213
NameBDBM50169213
Synonyms:CHEMBL371579 Cysteinylglycine N-L-cysteinylglycine
TypeSmall organic molecule
Emp. Form.C5H10N2O3S
Mol. Mass.178.21
SMILESN[C@@H](CS)C(=O)NCC(O)=O