Reaction Details
TargetSolute carrier family 15 member 2
LigandBDBM50169222
Substrate/Competitorn/a
Meas. Tech.ChEMBL_762551 (CHEMBL1817008)
Ki 54000±n/a nM
Citation Pedretti, ADe Luca, LMarconi, CRegazzoni, LAldini, GVistoli, G Fragmental modeling of hPepT2 and analysis of its binding features by docking studies and pharmacophore mapping. Bioorg Med Chem19:4544-51 (2011) 
 
Solute carrier family 15 member 2
Name:Solute carrier family 15 member 2
Type:PROTEIN
Mol. Mass.:81795.62
Organism:Homo sapiens (Human)
Description:ChEMBL_762551
Residue:729
BDBM50169222
NameBDBM50169222
Synonyms:2-(aminoacetamido)acetic acid Gly-Gly N-glycylglycine glycine dipeptide | glycylglycine
TypeSmall organic molecule
Emp. Form.C4H8N2O3
Mol. Mass.132.1179
SMILESNCC(=O)NCC(O)=O