Reaction Details
TargetSolute carrier family 15 member 2
LigandBDBM50169207
Substrate/Competitorn/a
Meas. Tech.ChEMBL_762551 (CHEMBL1817008)
Ki 14000±n/a nM
Citation Pedretti, ADe Luca, LMarconi, CRegazzoni, LAldini, GVistoli, G Fragmental modeling of hPepT2 and analysis of its binding features by docking studies and pharmacophore mapping. Bioorg Med Chem19:4544-51 (2011) 
 
Solute carrier family 15 member 2
Name:Solute carrier family 15 member 2
Type:PROTEIN
Mol. Mass.:81795.62
Organism:Homo sapiens (Human)
Description:ChEMBL_762551
Residue:729
BDBM50169207
NameBDBM50169207
Synonyms:(S)-2-[(S)-2-((2S,3S)-2-Amino-3-methyl-pentanoylamino)-3-methyl-butyrylamino]-3-(4-hydroxy-phenyl)-propionic acid | CHEMBL188747
TypeSmall organic molecule
Emp. Form.C20H31N3O5
Mol. Mass.393.4772
SMILESCC[C@H](C)[C@H](N)C(=O)N[C@@H](C(C)C)C(=O)N[C@@H](Cc1ccc(O)cc1)C(O)=O