Reaction Details
TargetSolute carrier family 15 member 2
LigandBDBM50350479
Substrate/Competitorn/a
Meas. Tech.ChEMBL_762551 (CHEMBL1817008)
Ki 16000±n/a nM
Citation Pedretti, ADe Luca, LMarconi, CRegazzoni, LAldini, GVistoli, G Fragmental modeling of hPepT2 and analysis of its binding features by docking studies and pharmacophore mapping. Bioorg Med Chem19:4544-51 (2011) 
 
Solute carrier family 15 member 2
Name:Solute carrier family 15 member 2
Type:PROTEIN
Mol. Mass.:81795.62
Organism:Homo sapiens (Human)
Description:ChEMBL_762551
Residue:729
BDBM50350479
NameBDBM50350479
Synonyms:CHEMBL1814494
TypeSmall organic molecule
Emp. Form.C11H21N3O4
Mol. Mass.259.3021
SMILESC[C@H](NC(=O)[C@H](CCCCN)NC(C)=O)C(O)=O