Reaction Details
TargetSolute carrier family 15 member 2
LigandBDBM50350480
Substrate/Competitorn/a
Meas. Tech.ChEMBL_762551 (CHEMBL1817008)
Ki 6000±n/a nM
Citation Pedretti, ADe Luca, LMarconi, CRegazzoni, LAldini, GVistoli, G Fragmental modeling of hPepT2 and analysis of its binding features by docking studies and pharmacophore mapping. Bioorg Med Chem19:4544-51 (2011) 
 
Solute carrier family 15 member 2
Name:Solute carrier family 15 member 2
Type:PROTEIN
Mol. Mass.:81795.62
Organism:Homo sapiens (Human)
Description:ChEMBL_762551
Residue:729
BDBM50350480
NameBDBM50350480
Synonyms:CHEMBL1814495
TypeSmall organic molecule
Emp. Form.C16H25N3O3
Mol. Mass.307.388
SMILESC[C@H](NC(=O)[C@H](CCCCN)NCc1ccccc1)C(O)=O