Reaction Details
TargetSolute carrier family 15 member 2
LigandBDBM50350482
Substrate/Competitorn/a
Meas. Tech.ChEMBL_762551 (CHEMBL1817008)
Ki 3000±n/a nM
Citation Pedretti, ADe Luca, LMarconi, CRegazzoni, LAldini, GVistoli, G Fragmental modeling of hPepT2 and analysis of its binding features by docking studies and pharmacophore mapping. Bioorg Med Chem19:4544-51 (2011) 
 
Solute carrier family 15 member 2
Name:Solute carrier family 15 member 2
Type:PROTEIN
Mol. Mass.:81795.62
Organism:Homo sapiens (Human)
Description:ChEMBL_762551
Residue:729
BDBM50350482
NameBDBM50350482
Synonyms:CHEMBL1222165
TypeSmall organic molecule
Emp. Form.C10H20N2O3S2
Mol. Mass.280.407
SMILESCSCC[C@H](N)C(=O)N[C@@H](CCSC)C(O)=O