Reaction Details
TargetSolute carrier family 15 member 2
LigandBDBM50169160
Substrate/Competitorn/a
Meas. Tech.ChEMBL_762551 (CHEMBL1817008)
Ki 4000±n/a nM
Citation Pedretti, ADe Luca, LMarconi, CRegazzoni, LAldini, GVistoli, G Fragmental modeling of hPepT2 and analysis of its binding features by docking studies and pharmacophore mapping. Bioorg Med Chem19:4544-51 (2011) 
 
Solute carrier family 15 member 2
Name:Solute carrier family 15 member 2
Type:PROTEIN
Mol. Mass.:81795.62
Organism:Homo sapiens (Human)
Description:ChEMBL_762551
Residue:729
BDBM50169160
NameBDBM50169160
Synonyms:(S)-2-((S)-2-amino-3-(1H-indol-3-yl)propanamido)propanoic acid CHEMBL188866 | Trp-Ala
TypeSmall organic molecule
Emp. Form.C14H17N3O3
Mol. Mass.275.3031
SMILESC[C@H](NC(=O)[C@@H](N)Cc1c[nH]c2ccccc12)C(O)=O