Reaction Details
TargetTranscriptional activator protein LuxR
LigandBDBM50350711
Substrate/Competitorn/a
Meas. Tech.ChEMBL_762767 (CHEMBL1816069)
IC50 350±n/a nM
Citation McInnis, CEBlackwell, HE Thiolactone modulators of quorum sensing revealed through library design and screening. Bioorg Med Chem19:4820-8 (2011) 
 
Transcriptional activator protein LuxR
Name:Transcriptional activator protein LuxR
Type:PROTEIN
Mol. Mass.:28563.86
Organism:Vibrio fischeri
Description:ChEMBL_831639
Residue:250
BDBM50350711
NameBDBM50350711
Synonyms:CHEMBL1812089
TypeSmall organic molecule
Emp. Form.C18H17NO2S
Mol. Mass.311.398
SMILESO=C(Cc1ccc(cc1)-c1ccccc1)N[C@H]1CCSC1=O