Reaction Details
TargetHistamine H3 receptor
LigandBDBM50350022
Substrate/Competitorn/a
Meas. Tech.ChEMBL_767070 (CHEMBL1826119)
Ki 1±n/a nM
Citation Sundar, BGBailey, TBacon, EAimone, LHuang, ZLyons, JRaddatz, RHudkins, R Amine-constrained pyridazinone histamine H3 receptor antagonists. Bioorg Med Chem Lett21:5543-6 (2011) 
 
Histamine H3 receptor
Name:Histamine H3 receptor
Type:G Protein-Coupled Receptor (GPCR)
Mol. Mass.:48691.47
Organism:Homo sapiens (Human)
Description:Binding assays were using CHO cells stably expressing hH3R receptors.
Residue:445
BDBM50350022
NameBDBM50350022
Synonyms:CHEMBL1813057
TypeSmall organic molecule
Emp. Form.C19H25N3O2
Mol. Mass.327.4207
SMILESC[C@@H]1CCCN1CCCOc1ccc(cc1)-c1ccc(=O)n(C)n1