Reaction Details
TargetHistamine H3 receptor
LigandBDBM50350022
Substrate/Competitorn/a
Meas. Tech.ChEMBL_767071 (CHEMBL1826120)
Ki 6±n/a nM
Citation Sundar, BGBailey, TBacon, EAimone, LHuang, ZLyons, JRaddatz, RHudkins, R Amine-constrained pyridazinone histamine H3 receptor antagonists. Bioorg Med Chem Lett21:5543-6 (2011) 
 
Histamine H3 receptor
Name:Histamine H3 receptor
Type:G Protein-Coupled Receptor (GPCR)
Mol. Mass.:48607.98
Organism:Rattus norvegicus (rat)
Description:n/a
Residue:445
BDBM50350022
NameBDBM50350022
Synonyms:CHEMBL1813057
TypeSmall organic molecule
Emp. Form.C19H25N3O2
Mol. Mass.327.4207
SMILESC[C@@H]1CCCN1CCCOc1ccc(cc1)-c1ccc(=O)n(C)n1