Reaction Details
TargetAurora kinase A
LigandBDBM50353271
Substrate/Competitorn/a
Meas. Tech.ChEMBL_768713 (CHEMBL1831496)
IC50 25±n/a nM
Citation Shaaban, MRSaleh, TSMayhoub, ASFarag, AM Single step synthesis of new fused pyrimidine derivatives and their evaluation as potent Aurora-A kinase inhibitors. Eur J Med Chem46:3690-5 (2011) 
 
Aurora kinase A
Name:Aurora kinase A
Type:Serine/threonine-protein kinase
Mol. Mass.:45830.98
Organism:Homo sapiens (Human)
Description:O14965
Residue:403
BDBM50353271
NameBDBM50353271
Synonyms:CHEMBL1830670
TypeSmall organic molecule
Emp. Form.C25H19N3O3S
Mol. Mass.441.502
SMILESCOc1ccc(cc1)-c1cc2ncc(c(-c3ccccc3)n2n1)S(=O)(=O)c1ccccc1