Reaction Details
TargetHistamine H3 receptor
LigandBDBM50355121
Substrate/Competitorn/a
Meas. Tech.ChEMBL_772494 (CHEMBL1839285)
Ki 0.5±n/a nM
Citation Tao, MRaddatz, RAimone, LDHudkins, RL Synthesis and structure-activity relationships of 4,5-fused pyridazinones as histamine H3 receptor antagonists. Bioorg Med Chem Lett21:6126-30 (2011) 
 
Histamine H3 receptor
Name:Histamine H3 receptor
Type:G Protein-Coupled Receptor (GPCR)
Mol. Mass.:48691.47
Organism:Homo sapiens (Human)
Description:Binding assays were using CHO cells stably expressing hH3R receptors.
Residue:445
BDBM50355121
NameBDBM50355121
Synonyms:CHEMBL1835783
TypeSmall organic molecule
Emp. Form.C22H29N3O2
Mol. Mass.367.4846
SMILESCn1nc(c2CCCc2c1=O)-c1ccc(OCCCN2CCCCC2)cc1