Reaction Details
TargetHistamine H3 receptor
LigandBDBM50355120
Substrate/Competitorn/a
Meas. Tech.ChEMBL_772494 (CHEMBL1839285)
Ki 0.4±n/a nM
Citation Tao, MRaddatz, RAimone, LDHudkins, RL Synthesis and structure-activity relationships of 4,5-fused pyridazinones as histamine H3 receptor antagonists. Bioorg Med Chem Lett21:6126-30 (2011) 
 
Histamine H3 receptor
Name:Histamine H3 receptor
Type:G Protein-Coupled Receptor (GPCR)
Mol. Mass.:48691.47
Organism:Homo sapiens (Human)
Description:Binding assays were using CHO cells stably expressing hH3R receptors.
Residue:445
BDBM50355120
NameBDBM50355120
Synonyms:CHEMBL1835782
TypeSmall organic molecule
Emp. Form.C22H29N3O2
Mol. Mass.367.4846
SMILESC[C@@H]1CCCN1CCCOc1ccc(cc1)-c1nn(C)c(=O)c2CCCc12