Reaction Details
TargetHistamine H3 receptor
LigandBDBM50355135
Substrate/Competitorn/a
Meas. Tech.ChEMBL_772494 (CHEMBL1839285)
Ki 1.9±n/a nM
Citation Tao, MRaddatz, RAimone, LDHudkins, RL Synthesis and structure-activity relationships of 4,5-fused pyridazinones as histamine H3 receptor antagonists. Bioorg Med Chem Lett21:6126-30 (2011) 
 
Histamine H3 receptor
Name:Histamine H3 receptor
Type:G Protein-Coupled Receptor (GPCR)
Mol. Mass.:48691.47
Organism:Homo sapiens (Human)
Description:Binding assays were using CHO cells stably expressing hH3R receptors.
Residue:445
BDBM50355135
NameBDBM50355135
Synonyms:CHEMBL1835773
TypeSmall organic molecule
Emp. Form.C23H29N3O2S
Mol. Mass.411.56
SMILESCC(C)n1nc(-c2ccc(OCCCN3CCCCC3)cc2)c2sccc2c1=O