Reaction Details
TargetTGF-beta receptor type-1
LigandBDBM50252542
Substrate/Competitorn/a
Meas. Tech.ChEMBL_772820 (CHEMBL1837692)
IC50 17.2±n/a nM
Citation Jin, CHKrishnaiah, MSreenu, DSubrahmanyam, VBRao, KSMohan, AVPark, CYSon, JYSheen, YYKim, DK Synthesis and biological evaluation of 1-substituted-3-(6-methylpyridin-2-yl)-4-([1,2,4]triazolo[1,5-a]pyridin-6-yl)pyrazoles as transforming growth factor-ß type 1 receptor kinase inhibitors. Bioorg Med Chem Lett21:6049-53 (2011) 
 
TGF-beta receptor type-1
Name:TGF-beta receptor type-1
Type:enzyme
Mol. Mass.:55968.24
Organism:Homo sapiens (Human)
Description:P36897
Residue:503
BDBM50252542
NameBDBM50252542
Synonyms:3-((5-(6-methylpyridin-2-yl)-4-(quinoxalin-6-yl)-1H-imidazol-2-yl)methyl)benzamide IN-1130
TypeSmall organic molecule
Emp. Form.C25H20N6O
Mol. Mass.420.4659
SMILESCc1cccc(n1)-c1nc(Cc2cccc(c2)C(N)=O)[nH]c1-c1ccc2nccnc2c1