Reaction Details
TargetTGF-beta receptor type-1
LigandBDBM50355198
Substrate/Competitorn/a
Meas. Tech.ChEMBL_772820 (CHEMBL1837692)
IC50 0.57±n/a nM
Citation Jin, CHKrishnaiah, MSreenu, DSubrahmanyam, VBRao, KSMohan, AVPark, CYSon, JYSheen, YYKim, DK Synthesis and biological evaluation of 1-substituted-3-(6-methylpyridin-2-yl)-4-([1,2,4]triazolo[1,5-a]pyridin-6-yl)pyrazoles as transforming growth factor-ß type 1 receptor kinase inhibitors. Bioorg Med Chem Lett21:6049-53 (2011) 
 
TGF-beta receptor type-1
Name:TGF-beta receptor type-1
Type:enzyme
Mol. Mass.:55968.24
Organism:Homo sapiens (Human)
Description:P36897
Residue:503
BDBM50355198
NameBDBM50355198
Synonyms:CHEMBL1835530
TypeSmall organic molecule
Emp. Form.C23H19N7OS
Mol. Mass.441.508
SMILESCOc1ccc(NC(=S)n2cc(c(n2)-c2cccc(C)n2)-c2ccc3ncnn3c2)cc1