Reaction Details
TargetC-C chemokine receptor type 5
LigandBDBM50378979
Substrate/Competitorn/a
Meas. Tech.ChEMBL_809506 (CHEMBL2015361)
Kd 28600±n/a nM
Citation Navratilova, IBesnard, JHopkins, AL Screening for GPCR Ligands Using Surface Plasmon Resonance. ACS Med Chem Lett2:549-554 (2011) 
 
C-C chemokine receptor type 5
Name:C-C chemokine receptor type 5
Type:Enzyme
Mol. Mass.:40540.21
Organism:Homo sapiens (Human)
Description:P51681
Residue:352
BDBM50378979
NameBDBM50378979
Synonyms:CHEMBL2011441
TypeSmall organic molecule
Emp. Form.C9H7BrClN3O3S2
Mol. Mass.384.657
SMILESCOc1nc(Br)cnc1NS(=O)(=O)c1ccc(Cl)s1