Reaction Details
TargetSomatostatin receptor type 4
LigandBDBM50051568
Substrate/Competitorn/a
Meas. Tech.ChEMBL_809617 (CHEMBL2015743)
IC50>1000±n/a nM
Citation Chatterjee, JLaufer, BBeck, JGHelyes, ZPintér, ESzolcsányi, JHorvath, AMandl, JReubi, JCKéri, GKessler, H N-Methylated sst2 Selective Somatostatin Cyclic Peptide Analogue as a Potent Candidate for Treating Neurogenic Inflammation. ACS Med Chem Lett2:509-514 (2011) 
 
Somatostatin receptor type 4
Name:Somatostatin receptor type 4
Type:Enzyme
Mol. Mass.:42015.38
Organism:Homo sapiens (Human)
Description:P31391
Residue:388
BDBM50051568
NameBDBM50051568
Synonyms:(3S,6S,9S,12R,15S,18S)-9-(4-Amino-butyl)-3-benzyl-15-(4-hydroxy-benzyl)-12-(1H-indol-3-ylmethyl)-6-isopropyl-1,18-dimethyl-1,4,7,10,13,16hexaaza-cyclooctadecane-2,5,8,11,14,17-hexaone seglitide
TypeSmall organic molecule
Emp. Form.C44H56N8O7
Mol. Mass.808.9648
SMILESCC(C)[C@@H]1NC(=O)[C@H](CCCCN)NC(=O)[C@@H](Cc2c[nH]c3ccccc23)NC(=O)[C@H](Cc2ccc(O)cc2)NC(=O)[C@H](C)N(C)C(=O)[C@H](Cc2ccccc2)NC1=O