Reaction Details
TargetNon-lysosomal glucosylceramidase
LigandBDBM50312527
Substrate/Competitorn/a
Meas. Tech.ChEMBL_809645 (CHEMBL2015864)
IC50 30±n/a nM
Citation van den Berg, RJWennekes, TGhisaidoobe, ADonker-Koopman, WEStrijland, ABoot, RGvan der Marel, GAAerts, JMOverkleeft, HS Assessment of partially deoxygenated deoxynojirimycin derivatives as glucosylceramide synthase inhibitors. ACS Med Chem Lett2:519-522 (2011) 
 
Non-lysosomal glucosylceramidase
Name:Non-lysosomal glucosylceramidase
Type:PROTEIN
Mol. Mass.:104639.04
Organism:Homo sapiens (Human)
Description:ChEMBL_1435476
Residue:927
BDBM50312527
NameBDBM50312527
Synonyms:CHEMBL1086996 | N-[5-(Adamantan-1-yl-methoxy)-pentyl]-L-ido-1-deoxynojirimycin
TypeSmall organic molecule
Emp. Form.C22H39NO5
Mol. Mass.397.5488
SMILESOC[C@H]1[C@@H](O)[C@H](O)[C@@H](O)CN1CCCCCOCC12CC3CC(CC(C3)C1)C2