Reaction Details
TargetBeta-3 adrenergic receptor
LigandBDBM50379086
Substrate/Competitorn/a
Meas. Tech.ChEMBL_809682 (CHEMBL2015993)
EC50 5±n/a nM
Citation Jesudason, CDBaker, JEBryant, RDFisher, JWGaich, GAHe, MMKahl, SDKriauciunas, AVHeiman, MLPeters, MARito, CJSatterwhite, JHTinsley, FCTrankle, WGShuker, AJ Combination of a Beta adrenoceptor modulator and a norepinephrine-serotonin uptake inhibitor for the treatment of obesity. ACS Med Chem Lett2:583-586 (2011) 
 
Beta-3 adrenergic receptor
Name:Beta-3 adrenergic receptor
Type:PROTEIN
Mol. Mass.:43161.83
Organism:Rattus norvegicus
Description:ChEMBL_1509452
Residue:400
BDBM50379086
NameBDBM50379086
Synonyms:CHEMBL2012521 LY-377604
TypeSmall organic molecule
Emp. Form.C31H32N4O4
Mol. Mass.524.6102
SMILESCC(C)(Cc1ccc(Oc2ccc(cn2)C(N)=O)cc1)NC[C@H](O)COc1cccc2[nH]c3ccccc3c12