Reaction Details
TargetPotassium voltage-gated channel subfamily H member 2
LigandBDBM50379423
Substrate/Competitorn/a
Meas. Tech.ChEMBL_811993 (CHEMBL2013363)
Ki 100±n/a nM
Citation Bregman, HNguyen, HNFeric, ELigutti, JLiu, DMcDermott, JSWilenkin, BZou, AHuang, LLi, XMcDonough, SIDimauro, EF The discovery of aminopyrazines as novel, potent Na(v)1.7 antagonists: hit-to-lead identification and SAR. Bioorg Med Chem Lett22:2033-42 (2012) 
 
Potassium voltage-gated channel subfamily H member 2
Name:Potassium voltage-gated channel subfamily H member 2
Type:Multi-pass membrane protein
Mol. Mass.:126672.65
Organism:Homo sapiens (Human)
Description:Q12809
Residue:1159
BDBM50379423
NameBDBM50379423
Synonyms:CHEMBL2012038
TypeSmall organic molecule
Emp. Form.C17H13F3N4O2
Mol. Mass.362.3059
SMILESNc1ccnc(Nc2ccc(Oc3ccc(OC(F)(F)F)cc3)cc2)n1