Reaction Details
TargetCytochrome P450 3A4
LigandBDBM50379619
Substrate/Competitorn/a
Meas. Tech.ChEMBL_811711 (CHEMBL2014286)
IC50>30000±n/a nM
Citation Dandu, RRLyons, JARaddatz, RHuang, ZAimone, LDHudkins, RL Synthesis and evaluation of a new series of 1'-cyclobutyl-6-(4-piperidyloxy)spiro[benzopyran-2,4'-piperidine] derivatives as high affinity and selective histamine-3 receptor (H3R) antagonists. Bioorg Med Chem Lett22:2151-3 (2012) 
 
Cytochrome P450 3A4
Name:Cytochrome P450 3A4
Type:Enzyme
Mol. Mass.:57349.57
Organism:Homo sapiens (Human)
Description:n/a
Residue:503
BDBM50379619
NameBDBM50379619
Synonyms:CHEMBL2013052
TypeSmall organic molecule
Emp. Form.C26H38N2O3
Mol. Mass.426.5915
SMILESCC(C)C(=O)N1CCC(CC1)Oc1ccc2OC3(CCN(CC3)C3CCC3)CCc2c1