Reaction Details
TargetSerine/threonine-protein kinase Chk1
LigandBDBM50379627
Substrate/Competitorn/a
Meas. Tech.ChEMBL_811848 (CHEMBL2014579)
IC50 33±n/a nM
Citation Dudkin, VYWang, CArrington, KLFraley, MEHartman, GDStirdivant, SMDrakas, RARickert, KWalsh, ESHamilton, KBuser, CAHardwick, JTao, WBeck, SCMao, XLobell, RBSepp-Lorenzino, L Pyridyl aminothiazoles as potent Chk1 inhibitors: optimization of cellular activity. Bioorg Med Chem Lett22:2613-9 (2012) 
 
Serine/threonine-protein kinase Chk1
Name:Serine/threonine-protein kinase Chk1
Type:Enzyme Catalytic Domain
Mol. Mass.:54443.02
Organism:Homo sapiens (Human)
Description:gi_166295192
Residue:476
BDBM50379627
NameBDBM50379627
Synonyms:CHEMBL2013060
TypeSmall organic molecule
Emp. Form.C18H19N5S
Mol. Mass.337.442
SMILESC1CN(CCN1)c1cccc(Nc2ncc(s2)-c2ccccc2)n1