Reaction Details
TargetSerine/threonine-protein kinase Chk1
LigandBDBM50379640
Substrate/Competitorn/a
Meas. Tech.ChEMBL_811848 (CHEMBL2014579)
IC50 7±n/a nM
Citation Dudkin, VYWang, CArrington, KLFraley, MEHartman, GDStirdivant, SMDrakas, RARickert, KWalsh, ESHamilton, KBuser, CAHardwick, JTao, WBeck, SCMao, XLobell, RBSepp-Lorenzino, L Pyridyl aminothiazoles as potent Chk1 inhibitors: optimization of cellular activity. Bioorg Med Chem Lett22:2613-9 (2012) 
 
Serine/threonine-protein kinase Chk1
Name:Serine/threonine-protein kinase Chk1
Type:Enzyme Catalytic Domain
Mol. Mass.:54443.02
Organism:Homo sapiens (Human)
Description:gi_166295192
Residue:476
BDBM50379640
NameBDBM50379640
Synonyms:CHEMBL2013159
TypeSmall organic molecule
Emp. Form.C19H20N6O2S
Mol. Mass.396.466
SMILESCNC(=O)c1cncc(c1)-c1cnc(Nc2cc(ccn2)N2CCOCC2)s1