Reaction Details
TargetCyclin-dependent kinase 7
LigandBDBM50379632
Substrate/Competitorn/a
Meas. Tech.ChEMBL_811849 (CHEMBL2014580)
IC50 260±n/a nM
Citation Dudkin, VYWang, CArrington, KLFraley, MEHartman, GDStirdivant, SMDrakas, RARickert, KWalsh, ESHamilton, KBuser, CAHardwick, JTao, WBeck, SCMao, XLobell, RBSepp-Lorenzino, L Pyridyl aminothiazoles as potent Chk1 inhibitors: optimization of cellular activity. Bioorg Med Chem Lett22:2613-9 (2012) 
 
Cyclin-dependent kinase 7
Name:Cyclin-dependent kinase 7
Type:Enzyme Subunit
Mol. Mass.:39047.01
Organism:Homo sapiens (Human)
Description:n/a
Residue:346
BDBM50379632
NameBDBM50379632
Synonyms:CHEMBL2011349
TypeSmall organic molecule
Emp. Form.C20H20N8S
Mol. Mass.404.491
SMILESC1CN(CCN1)c1ccnc(Nc2ncc(s2)-c2cncc(c2)-c2cn[nH]c2)c1