Reaction Details
TargetCyclin-dependent kinase 7
LigandBDBM50379641
Substrate/Competitorn/a
Meas. Tech.ChEMBL_811849 (CHEMBL2014580)
IC50 340±n/a nM
Citation Dudkin, VYWang, CArrington, KLFraley, MEHartman, GDStirdivant, SMDrakas, RARickert, KWalsh, ESHamilton, KBuser, CAHardwick, JTao, WBeck, SCMao, XLobell, RBSepp-Lorenzino, L Pyridyl aminothiazoles as potent Chk1 inhibitors: optimization of cellular activity. Bioorg Med Chem Lett22:2613-9 (2012) 
 
Cyclin-dependent kinase 7
Name:Cyclin-dependent kinase 7
Type:Enzyme Subunit
Mol. Mass.:39047.01
Organism:Homo sapiens (Human)
Description:n/a
Residue:346
BDBM50379641
NameBDBM50379641
Synonyms:CHEMBL2010809
TypeSmall organic molecule
Emp. Form.C20H23N7O2S
Mol. Mass.425.507
SMILESNCCNC(=O)c1cncc(c1)-c1cnc(Nc2cc(ccn2)N2CCOCC2)s1