Reaction Details
TargetCyclin-dependent kinase 7
LigandBDBM50379622
Substrate/Competitorn/a
Meas. Tech.ChEMBL_811849 (CHEMBL2014580)
IC50 960±n/a nM
Citation Dudkin, VYWang, CArrington, KLFraley, MEHartman, GDStirdivant, SMDrakas, RARickert, KWalsh, ESHamilton, KBuser, CAHardwick, JTao, WBeck, SCMao, XLobell, RBSepp-Lorenzino, L Pyridyl aminothiazoles as potent Chk1 inhibitors: optimization of cellular activity. Bioorg Med Chem Lett22:2613-9 (2012) 
 
Cyclin-dependent kinase 7
Name:Cyclin-dependent kinase 7
Type:Enzyme Subunit
Mol. Mass.:39047.01
Organism:Homo sapiens (Human)
Description:n/a
Residue:346
BDBM50379622
NameBDBM50379622
Synonyms:CHEMBL2013161
TypeSmall organic molecule
Emp. Form.C16H15ClN6OS
Mol. Mass.374.848
SMILESNCCNC(=O)c1cncc(c1)-c1cnc(Nc2ncccc2Cl)s1