Reaction Details
TargetCyclin-dependent kinase 7
LigandBDBM50379651
Substrate/Competitorn/a
Meas. Tech.ChEMBL_811849 (CHEMBL2014580)
IC50 350±n/a nM
Citation Dudkin, VYWang, CArrington, KLFraley, MEHartman, GDStirdivant, SMDrakas, RARickert, KWalsh, ESHamilton, KBuser, CAHardwick, JTao, WBeck, SCMao, XLobell, RBSepp-Lorenzino, L Pyridyl aminothiazoles as potent Chk1 inhibitors: optimization of cellular activity. Bioorg Med Chem Lett22:2613-9 (2012) 
 
Cyclin-dependent kinase 7
Name:Cyclin-dependent kinase 7
Type:Enzyme Subunit
Mol. Mass.:39047.01
Organism:Homo sapiens (Human)
Description:n/a
Residue:346
BDBM50379651
NameBDBM50379651
Synonyms:CHEMBL2013169
TypeSmall organic molecule
Emp. Form.C20H22FN7OS
Mol. Mass.427.498
SMILESNCNC(=O)c1cncc(c1)-c1cnc(Nc2cc(ccn2)N2CCC(F)CC2)s1