Reaction Details
TargetSerine/threonine-protein kinase Chk1
LigandBDBM50379769
Substrate/Competitorn/a
Meas. Tech.ChEMBL_812462 (CHEMBL2014248)
IC50 12±n/a nM
Citation Dudkin, VYRickert, KKreatsoulas, CWang, CArrington, KLFraley, MEHartman, GDYan, YIkuta, MStirdivant, SMDrakas, RAWalsh, ESHamilton, KBuser, CALobell, RBSepp-Lorenzino, L Pyridyl aminothiazoles as potent inhibitors of Chk1 with slow dissociation rates. Bioorg Med Chem Lett22:2609-12 (2012) 
 
Serine/threonine-protein kinase Chk1
Name:Serine/threonine-protein kinase Chk1
Type:Enzyme Catalytic Domain
Mol. Mass.:54443.02
Organism:Homo sapiens (Human)
Description:gi_166295192
Residue:476
BDBM50379769
NameBDBM50379769
Synonyms:CHEMBL2011358
TypeSmall organic molecule
Emp. Form.C20H24N6OS
Mol. Mass.396.509
SMILESNCCCc1cncc(c1)-c1cnc(Nc2cc(ccn2)N2CCOCC2)s1