Reaction Details
TargetSerine/threonine-protein kinase Chk1
LigandBDBM50379767
Substrate/Competitorn/a
Meas. Tech.ChEMBL_812462 (CHEMBL2014248)
IC50 0.400000±n/a nM
Citation Dudkin, VYRickert, KKreatsoulas, CWang, CArrington, KLFraley, MEHartman, GDYan, YIkuta, MStirdivant, SMDrakas, RAWalsh, ESHamilton, KBuser, CALobell, RBSepp-Lorenzino, L Pyridyl aminothiazoles as potent inhibitors of Chk1 with slow dissociation rates. Bioorg Med Chem Lett22:2609-12 (2012) 
 
Serine/threonine-protein kinase Chk1
Name:Serine/threonine-protein kinase Chk1
Type:Enzyme Catalytic Domain
Mol. Mass.:54443.02
Organism:Homo sapiens (Human)
Description:gi_166295192
Residue:476
BDBM50379767
NameBDBM50379767
Synonyms:CHEMBL2011356
TypeSmall organic molecule
Emp. Form.C21H25N7O2S
Mol. Mass.439.534
SMILESNCCNC(=O)c1cncc(c1)-c1cnc(Nc2cc(CN3CCOCC3)ccn2)s1