Reaction Details
TargetProstaglandin G/H synthase 2
LigandBDBM50296247
Substrate/Competitorn/a
Meas. Tech.ChEMBL_809727 (CHEMBL2016146)
IC50 42500±n/a nM
Citation Takahashi, TMiyazawa, M N-Caffeoyl serotonin as selective COX-2 inhibitor. Bioorg Med Chem Lett22:2494-6 (2012) 
 
Prostaglandin G/H synthase 2
Name:Prostaglandin G/H synthase 2
Type:Enzyme
Mol. Mass.:69003.89
Organism:Homo sapiens (Human)
Description:Recombinant Cox-2 provided by Cayman (Cayman Chemical Co.,Ann Arbor, MI).
Residue:604
BDBM50296247
NameBDBM50296247
Synonyms:3-(3,4-Dihydroxyphenyl)-N-[2-(5-hydroxyindol-3-yl)ethyl]-2-propenamide | CHEMBL559089
TypeSmall organic molecule
Emp. Form.C19H18N2O4
Mol. Mass.338.3572
SMILESOc1ccc2[nH]cc(CCNC(=O)\C=C\c3ccc(O)c(O)c3)c2c1