Reaction Details
TargetProstaglandin G/H synthase 2
LigandBDBM50341142
Substrate/Competitorn/a
Meas. Tech.ChEMBL_809727 (CHEMBL2016146)
IC50 28000±n/a nM
Citation Takahashi, TMiyazawa, M N-Caffeoyl serotonin as selective COX-2 inhibitor. Bioorg Med Chem Lett22:2494-6 (2012) 
 
Prostaglandin G/H synthase 2
Name:Prostaglandin G/H synthase 2
Type:Enzyme
Mol. Mass.:69003.89
Organism:Homo sapiens (Human)
Description:Recombinant Cox-2 provided by Cayman (Cayman Chemical Co.,Ann Arbor, MI).
Residue:604
BDBM50341142
NameBDBM50341142
Synonyms:(E)-3-(4-Hydroxy-3,5-dimethoxy-phenyl)-acrylic acid 3-(4-hydroxy-3,5-dimethoxyphenyl)-(E)-2-propenoic acid CHEMBL109341 Sinapic acid
TypeSmall organic molecule
Emp. Form.C11H12O5
Mol. Mass.224.21
SMILESCOc1cc(\C=C\C(O)=O)cc(OC)c1O