Reaction Details
TargetPlasma kallikrein
LigandBDBM50092336
Substrate/Competitorn/a
Meas. Tech.ChEMBL_809738 (CHEMBL2016157)
IC50 710±n/a nM
Citation Liang, GChen, XAldous, SPu, SFMehdi, SPowers, EXia, TWang, R Human kallikrein 6 inhibitors with a para-amidobenzylanmine P1 group identified through virtual screening. Bioorg Med Chem Lett22:2450-5 (2012) 
 
Plasma kallikrein
Name:Plasma kallikrein
Type:Protein
Mol. Mass.:71391.16
Organism:Homo sapiens (Human)
Description:P03952
Residue:638
BDBM50092336
NameBDBM50092336
Synonyms:3-{2-[(4-Aminomethyl-cyclohexanecarbonyl)-amino]-3-[4-(pyrimidin-2-yloxy)-phenyl]-propionylamino}-benzoic acid | CHEMBL70520
TypeSmall organic molecule
Emp. Form.C28H31N5O5
Mol. Mass.517.5762
SMILESNCC1CC[C@@H](CC1)C(=O)NC(Cc1ccc(Oc2ncccn2)cc1)C(=O)Nc1cccc(c1)C(O)=O