Reaction Details
TargetCarbonic anhydrase 7
LigandBDBM50380145
Substrate/Competitorn/a
Meas. Tech.ChEMBL_811725 (CHEMBL2014300)
Kd 250±n/a nM
Citation Capkauskaite, EZubriene, ABaranauskiene, LTamulaitiene, GManakova, EKairys, VGražulis, STumkevicius, SMatulis, D Design of [(2-pyrimidinylthio)acetyl]benzenesulfonamides as inhibitors of human carbonic anhydrases. Eur J Med Chem51:259-70 (2012) 
 
Carbonic anhydrase 7
Name:Carbonic anhydrase 7
Type:Enzyme
Mol. Mass.:29664.11
Organism:Homo sapiens (Human)
Description:Human cloned isozyme.
Residue:264
BDBM50380145
NameBDBM50380145
Synonyms:CHEMBL2010992
TypeSmall organic molecule
Emp. Form.C15H17N3O4S2
Mol. Mass.367.443
SMILESCCCc1cc(=O)[nH]c(SCC(=O)c2ccc(cc2)S(N)(=O)=O)n1